Civilian Agency Acquisition Council
type: Class
alternative label: 民用机构采购委员会
subclass of: R2DCdd786Ff90AF697f01f8f
hidden label: CAAC
definition: The Civilian Agency Acquisition Council (CAAC) Assists the Administrator of General Services in developing and maintaining the Federal Acquisition Regulation (FAR) System by developing or reviewing all proposed changes to the FAR.