Pennsylvania Court of Common Pleas - Washington County
type: Class
subclass of: Rzg8mCIjXsMzEVnQwCTKIi
definition: The Pennsylvania Court of Common Pleas - Washington County is a specific court within the Pennsylvania Court of Common Pleas system, located in Washington County.