Physical Accessibility Claim
type: Class
subclass of: R9ROaRQTFgM9oWtVX4k6v6I
definition: A physical accessibility claim is made when a physical space or infrastructure, like a building, public space, or facility, is not accessible or usable by individuals with disabilities. This might involve a lack of ramps, inappropriately designed restrooms, or inaccessible public areas.