Copying Expense
type: Class
alternative label: 复印费用
subclass of: R8KRPJpptKbBzyQalWni4Zv
definition: The Copying Expense concept refers to the costs incurred for reproducing documents or materials, which are necessary for a legal matter and are considered as an expense.