Responses to Requests for Production
type: Class
alternative label: 生产请求的回应
subclass of: RtrxZGwgTL594abOAwpDkz
definition: Responses to Requests for Production are documents produced in response to a formal request for information during the discovery phase of a legal proceeding.