Affidavit of Prejudice
type: Class
alternative label: 偏见宣誓书
subclass of: R8VOMRqV6TS6A9httw7cSWP
subclass of: RDOgxjWbgT1G7Mx1GDer5EG
definition: An Affidavit of Prejudice is a legal document filed by a party in a case, alleging that the decision maker assigned to the case is biased or prejudiced against them, and requesting that the decision maker be disqualified from the case.