Administrative Judgment
type: Class
alternative label: 行政判决
subclass of: R9jpIjzc10qdgl78jXOZtfm
definition: An administrative judgment is a decision made by a government agency or administrative body, typically in regards to a specific case or issue.