Failure to Arbitrate
type: Class
alternative label: 未能仲裁
subclass of: RCzs34uEQI9f4cuWp3bQO0P
definition: The Failure to Arbitrate is a legal defense that arises when a party fails to comply with an agreement to resolve a dispute through arbitration, instead choosing to pursue litigation.