Corrected Brief
type: Class
alternative label: 更正简述
subclass of: R7RYnZ1GpjlQaMwVkwCyCss
definition: A corrected brief is a written legal document submitted to an appellate court that revises errors or mistakes in a previously filed brief.