Personal Jurisdiction by Fairness
type: Class
alternative label: 公平个人管辖权
subclass of: R7X4vuBVsbGf69DAu7Xotdw
definition: Personal Jurisdiction by Fairness refers to the authority of a court to hear a case based on the fairness of doing so, even if the defendant does not have sufficient minimum contacts with the forum state.