Separation Agreement
type: Class
preferred label: Marriage Termination Agreement
alternative label: 分居协议
subclass of: R88D8i8AcSTUig2X3yPbFHg
definition: A Separation Agreement is a written document that outlines the terms and conditions agreed upon by parties who are separating or divorcing, including issues such as property division, child custody, and support.