Motion for Jury Trial
type: Class
preferred label: Jury Request
alternative label: 陪审团审判动议
subclass of: R8zwKGkogGKIKWSVWb1ItRL
subclass of: R9Ii4OzSADsjS0VegX12oQJ
definition: A Motion for Jury Trial is a formal request made by a party in a legal case to have a trial by jury rather than a trial by judge.