Clare
type: Class
alternative label: IE+CE
subclass of: RC8259231A82dF97aedEBf63
hidden label: IE+CE
definition: Clare refers to a specific location in Ireland, which is a county situated in the mid-west region of the country.