Shaviyani
type: Class
alternative label: MV+24
subclass of: R45D3d83F1c4603C9903Af83
hidden label: MV+24
definition: Shaviyani is a subdivision of the Maldives, located in the northern part of the country.