Analysis of Pre-Petition Lien Issues
type: Class
alternative label: 审查申请前留置权问题
subclass of: RDrxLQS4WPXUa6tUdBGdu2r
definition: Analysis of Pre-Petition Lien Issues refers to the examination and evaluation of any legal claims or encumbrances on property that arise before the filing of a bankruptcy petition.