UTBMS MI00 Integration Matters
type: Class
subclass of: R9d2DkaIPGh2tQoNNOoEBMu
definition: The UTBMS MI00 Integration Matters concept refers to the specific task code used in the UTBMS Mergers and Acquisitions (M&A) category for legal billing, which covers the integration of two or more entities.