Social Security Claims
type: Class
alternative label: 社会保障索赔
subclass of: R9LVBKjvGRuzwgtlhuLST36
subclass of: R9q0hyYnNxQC475BKXOxjbm
definition: A claim made under the Social Security program, which provides benefits to eligible individuals based on their contributions to the program, or in some cases, based on their status as a dependent or survivor of a contributor.