Bureau of Prisons
type: Class
alternative label: 监狱局
subclass of: R0DB70442Cf8b73D9275F14a
hidden label: BOP
definition: The Federal Bureau of Prisons (BOP) is a United States federal law enforcement agency. A subdivision of the U.S. Department of Justice, the BOP is responsible for the administration of the federal prison system.