JG20 Reviewing Other Party witness statement (UK J-CODE)
type: Class
subclass of: RDAMHbsPj5qYsHvHXDwuZvx
definition: Considering Other Party(s)' witness statements, affidavits, witness summaries, Civil Evidence Act or similar notices, reviewing same in context of other evidence and material, considering strategy to deal with issues raised.