Illinois Circuit Court - Cook County
type: Class
subclass of: RCtUZjZqZ1lszDFiDOLUuTh
definition: Illinois Circuit Court - Cook County refers to a specific court within the Illinois Circuit Court system that has jurisdiction over legal matters in Cook County, Illinois.