Confidential Information Clause
type: Class
alternative label: 保密信息条款
subclass of: RDe0RKU39BlhcyACJW30ZLc
definition: A Confidential Information Clause is a provision in a contract that requires parties to keep certain information private and not disclose it to others without permission.