Return to Parent
type: Class
alternative label: 返回上级
subclass of: R9gqzNBOvSSiVGWHH7ZIXzM
definition: Return to Parent refers to the process of reuniting a child who has been placed in foster care with their biological parent(s) after the necessary steps have been taken to ensure the safety and well-being of the child.