New York District Court - Nassau County - 2nd District
type: Class
subclass of: R7aBbOhIQLuwrLOympuadoq
definition: New York District Court - Nassau County (2d Dist.) is a specific court within the New York District Court system located in Nassau County and is also referred to as 2d Dist.