Federal Service Impasses Panel
type: Class
alternative label: 联邦服务僵局委员会
subclass of: RC767f054E65a1DC6b565aa6
hidden label: FSIP
definition: The Federal Service Impasses Panel resolves impasses between federal agencies and unions representing federal employees arising from negotiations arising under the Federal Service Labor-Management Relations Statute and the Federal Employees Flexible and Compressed Work Schedules Act.