Plaintiff's Felonious Conduct
type: Class
alternative label: 原告的重罪行为
subclass of: RCzs34uEQI9f4cuWp3bQO0P
definition: Plaintiff's felonious conduct may prevent liability for damages based on negligence if plaintiff's injuries were in part caused by plaintiff's commission of a felony and plaintiff has been convicted of said felony.