Samaritan Aramaic
type: Class
alternative label: 撒马利亚阿拉姆语
subclass of: RDOvAHsvY8TKJ1O1orXPM9o
definition: Samaritan Aramaic is a dialect of Aramaic used by the Samaritan community in their religious texts and liturgy.