Minnesota District Court - Nobles County
type: Class
subclass of: RxLV9XEaDWbDIA8N1fl2fM
definition: A court located in Nobles County, Minnesota that has jurisdiction over civil and criminal cases within its geographical boundaries.