Air Transportation Industry
type: Class
alternative label: 航空运输业
subclass of: RUE4fCCSnGX1wIK324EyiL
hidden label: AIRT
definition: Industries in this group provide air transportation of passengers and/or cargo using aircraft, such as airplanes and helicopters.