Logone-Oriental
type: Class
alternative label: TD+LR
subclass of: R6EDec6FF87ec502564FAddf
hidden label: TD+LR
definition: Logone-Oriental is a region located in Chad, with the additional hidden labels of TD+LR.