Agreements
type: Class
preferred label: Contracts
alternative label: 协议
subclass of: RBJ4HPUl2DrL4G30lmoFKJN
definition: Agreements are written documents that establish a legally binding understanding between two or more parties, outlining the terms and conditions of a transaction or relationship.