Portuguese
type: Class
alternative label: 葡萄牙语
subclass of: RDOvAHsvY8TKJ1O1orXPM9o
definition: Portuguese (Language) is a structured system of communication consisting of grammar and vocabulary used in Portugal, Brazil, and other countries, and is a subcategory of the Language class.