Bankruptcy Ballot
type: Class
alternative label: 选票
subclass of: R8zijLH2GH0SxOhIdzeDOs3
definition: A ballot is a document used in bankruptcy and restructuring proceedings to vote on a proposed plan.