Yapese
type: Class
alternative label: 雅浦语
subclass of: RDOvAHsvY8TKJ1O1orXPM9o
definition: Yapese (Language) is a structured system of communication that consists of grammar and vocabulary specific to the Yapese culture and is a subcategory of the Language class.