Motion for Judgment Notwithstanding the Verdict
type: Class
alternative label: 判决不服申请书
subclass of: R7SdenAJ4aI0wyuxBsP7c09
subclass of: RCOztyLvDeuEOO20jLp0Gi3
subclass of: RUM0A3dwvk0A2dp3WHxNrj
definition: A Motion for Judgment Notwithstanding the Verdict (JNOV) is a post-trial motion that asks the court to overturn a jury verdict and enter judgment in favor of the moving party.