Power and Authority Representation
type: Class
alternative label: 权威表示
subclass of: R9rCNhUCohkUGbQyd1C3uzz
definition: A representation made by a party in a legal matter that they have the authority to act on behalf of another person or entity.