Unlawful Eviction of Tenant
type: Class
alternative label: 非法驱逐租户
subclass of: R97svnIdQhrkKZw6i3Nn88z
definition: The Unlawful Eviction of Tenant is the act of a landlord removing a tenant from their rental property without following the proper legal procedures, such as obtaining a court order or providing proper notice.