Deal Stance
type: Class
alternative label: 交易立场
subclass of: RDRCaFxX4hpUklgNnVS9D8C
definition: Deal stance refers to the approach taken by an acquiring company when pursuing a takeover of another company. They include hostile takeovers, friendly takeovers, proxy contests, control positions, and minority stakes.