Motion to File Late Opposition
type: Class
alternative label: 提交延迟反对申请
subclass of: R7pZSuLowh1QRBeGOhk6zEr
definition: A Motion to File Late Opposition is a request to the court to allow a party to submit their opposition to a motion after the deadline has passed.