U.S. Office of Personnel Management
type: Class
preferred label: Office of Personnel Management
alternative label: 美国人事管理局
subclass of: R22815eC3Af3bFF0d002Ca58
hidden label: OPM
definition: The United States Office of Personnel Management (OPM) is an independent agency of the United States federal government that manages the government's civilian workforce.