Right to a Speedy Trial
type: Class
alternative label: 快速审判权
subclass of: RBlWM6X0yqMrb4z4JQYaEP2
definition: A Right to a Speedy Trial claim a claim under many constitutions, which guarantee defendants in criminal prosecutions the right to a speedy trial. This right aims to limit the amount of time an accused person has to endure the anxiety and publicity of a pending criminal trial, and to reduce the potential for impairing the defense.