Legal Determination
type: Class
subclass of: RBDhSx7fl9qS0ezDVJuZHX4
definition: "Litigation determination" refers to the final outcome or verdict reached in a legal dispute or trial. It can include findings such as "guilty" in a criminal case or "liable" in a civil case when a party is held responsible, or "acquitted" when a defendant is found not guilty in a criminal trial. A single matter's legal determination can be split between claims (e.g., liable for one claim; not liable for another claim).