Criminal Conspiracy
type: Class
alternative label: 刑事共谋
subclass of: R7ma9Q5FiHDcIYgKoxKNUk9
subclass of: R8iqvgE2NjybgksTeqsGhr3
definition: A criminal agreement between two or more people to commit a crime, even if the crime is never carried out, falls under the concept of Criminal Conspiracy in the field of Inchoate Criminal Offenses and Concert of Action Crimes.