Public Nuisance
type: Class
alternative label: 公共妨碍
subclass of: R8Gzr9WKsdck4rRcLAqMHej
definition: A public nuisance is a type of nuisance that affects the community or the public at large, rather than just one individual or property owner.