Pediatric Negligence
type: Class
alternative label: 儿科疏忽
subclass of: R7Zbqfhemxs6PR7r2Fk6NeY
definition: Pediatric Negligence refers to a legal claim made by parents against medical professionals for failing to provide appropriate care to their child.