Actual Fraudulent Transfer
type: Class
alternative label: 实际欺诈转移
subclass of: RCNhEzNMvl0oCcXlBCMrSTL
definition: The concept of Actual Fraudulent Transfer refers to a transfer of property made with the intent to defraud a creditor, where the debtor acted with actual fraudulent intent.