Criminal Assault
type: Class
alternative label: 刑事侵犯
subclass of: R7MbuFEaL6NyU9tM2AXk7lk
definition: An unlawful physical attack by one person upon another where neither the offender displays a weapon, nor the victim suffers obvious severe or aggravated bodily injury involving apparent broken bones, loss of teeth, possible internal injury, severe laceration, or loss of consciousness.