Obligation to Pay Services Sought for Other
type: Class
alternative label: 为他人寻求服务的支付义务
subclass of: R7wZePVWBKLVfAUwDtboutg
subclass of: RZ1dOPJ6HH6lMJGSLNxfwV
definition: A legal duty to compensate for services that were requested for someone else, falling under the categories of agent liability, contract, and quasi-contract claims.