Falkland Islands pound
type: Class
alternative label: फ़ॉकलैंड द्वीप से जुड़ा पाउंड
subclass of: R767niCLQVC5zIcO5WDQMSl
hidden label: FKP
definition: Locations used: Falkland Islands(pegged to GBP 1:1)