Responses to Claims
type: Class
alternative label: 对索赔的回应
subclass of: R9q7GJc1zsYT0P4Xdp6l9Oz
definition: Responses to Claims refer to the various legal actions taken by a party in response to a claim made against them, including denial, counterclaim, and admission.