HUD Office of the Inspector General
type: Class
alternative label: HUD办公室的检察长
subclass of: R783351768f732C2badC6a0e
hidden label: HUDOIG
definition: The U.S. Department of Housing and Urban Development (HUD) Inspector General's mission is to detect and prevent fraud, waste, and abuse and promote the effectiveness and efficiency of government operations.